{"text_format":"1","workbook":"xlsx","n_sheets":4,"sheets":["申込一覧表","印刷","初期設定","DAT"],"not_rendered":{"charts":0,"images":0,"macros":1,"external_links":1,"defined_names":1,"comments":0,"pivot_tables":0},"unopened":[],"bounds":{"document_bytes":16777216,"sheet_cells":100000,"rows_first":2000,"rows_last":500,"rows_between":2000,"halvings":0,"cell_chars":16384,"cell_head_chars":4096},"cells_cut":0,"cells_raw":0,"read":"whole","date_system":"1900"}

{"sheet":"申込一覧表","index":0,"n_rows":96,"n_cols":28,"rows_kept":96,"cut":false,"hidden":false,"merged":[[0,14,0,15],[0,16,0,20],[1,1,1,2],[1,3,1,4],[1,5,1,7],[1,8,1,9],[1,10,1,11],[1,12,1,13],[1,14,1,15],[1,16,1,20],[0,1,0,2],[0,3,0,4],[0,5,0,7],[0,8,0,9],[0,10,0,11],[0,12,0,13]]}
["項目","所属コード",null,"所属名",null,"所在地",null,null,"電話",null,"携帯電話",null,"代表者名",null,"申込責任者",null,"大　　会　　名"]
["入力",{"$f":"IF(D2=\"\",\"\",VLOOKUP(D2,初期設定!G2:$J$27,4,FALSE))","v":""},null,null,null,null,null,null,null,null,null,null,null,null,null,null,"２６大学"]
[]
[]
[]
["No","氏　　名","学年","ﾌﾘｶﾞﾅ","男１・女２","生年月日","ナンバーカード","4R","16R","32R","ｺｰﾄﾞ","種目1","記録","大会","ｺｰﾄﾞ","種目2","記録","大会","ｺｰﾄﾞ","種目3","記録","大会","所属ｺｰﾄﾞ",null,"注",null,"ｺｰﾄﾞ","種目"]
[1,null,null,null,null,null,null,null,null,null,null,null,null,null,null,null,null,null,null,null,null,null,{"$f":"IF($B$2=\"\",\"\",$B$2)","v":""},{"$f":"IF(W7=\"\",\"\",VLOOKUP(W7,初期設定!$D$2:$I$27,4,FALSE))","v":""},"・","このフォームに","002","100m"]
[2,null,null,null,null,null,null,null,null,null,null,{"$f":"IF(K8=\"\",\"\",VLOOKUP(LEFT(K8,3),$AA$7:$AB$50,2,FALSE))","v":""},null,null,null,{"$f":"IF(O8=\"\",\"\",VLOOKUP(LEFT(O8,3),$AA$7:$AB$50,2,FALSE))","v":""},null,null,null,{"$f":"IF(S8=\"\",\"\",VLOOKUP(LEFT(S8,3),$AA$7:$AB$50,2,FALSE))","v":""},null,null,{"$f":"IF($B$2=\"\",\"\",$B$2)","v":""},{"$f":"IF(W8=\"\",\"\",VLOOKUP(W8,初期設定!$D$2:$I$27,4,FALSE))","v":""},null,"必要事項を入力し","003","200m"]
[3,null,null,null,null,null,null,null,null,null,null,"",null,null,null,"",null,null,null,"",null,null,"",{"$f":"IF(W9=\"\",\"\",VLOOKUP(W9,初期設定!$D$2:$I$27,4,FALSE))","v":""},null,"メールにて送付","005","400m"]
[4,null,null,null,null,null,null,null,null,null,null,"",null,null,null,"",null,null,null,"",null,null,"",{"$f":"IF(W10=\"\",\"\",VLOOKUP(W10,初期設定!$D$2:$I$27,4,FALSE))","v":""},null,"してください。","006","800m"]
[5,null,null,null,null,null,null,null,null,null,null,"",null,null,null,"",null,null,null,"",null,null,"",{"$f":"IF(W11=\"\",\"\",VLOOKUP(W11,初期設定!$D$2:$I$27,4,FALSE))","v":""},"・","種目、所属コードは","008","1500m"]
[6,null,null,null,null,null,null,null,null,null,null,"",null,null,null,"",null,null,null,"",null,null,"",{"$f":"IF(W12=\"\",\"\",VLOOKUP(W12,初期設定!$D$2:$I$27,4,FALSE))","v":""},null,"初期設定のページを","010","3000m"]
[7,null,null,null,null,null,null,null,null,null,null,"",null,null,null,"",null,null,null,"",null,null,"",{"$f":"IF(W13=\"\",\"\",VLOOKUP(W13,初期設定!$D$2:$I$27,4,FALSE))","v":""},null,"確認してください。","011","5000m"]
[8,null,null,null,null,null,null,null,null,null,null,"",null,null,null,"",null,null,null,"",null,null,"",{"$f":"IF(W14=\"\",\"\",VLOOKUP(W14,初期設定!$D$2:$I$27,4,FALSE))","v":""},"・","不明な箇所は、","012","10000m"]
[9,null,null,null,null,null,null,null,null,null,null,"",null,null,null,"",null,null,null,"",null,null,"",{"$f":"IF(W15=\"\",\"\",VLOOKUP(W15,初期設定!$D$2:$I$27,4,FALSE))","v":""},null,"空欄でも結構です。","032","110mH(中学)"]
[10,null,null,null,null,null,null,null,null,null,null,"",null,null,null,"",null,null,null,"",null,null,"",{"$f":"IF(W16=\"\",\"\",VLOOKUP(W16,初期設定!$D$2:$I$27,4,FALSE))","v":""},"・","記録は、できるだけ","033","110mH(ﾕｰｽ)"]
[11,null,null,null,null,null,null,null,null,null,null,"",null,null,null,"",null,null,null,"",null,null,"",{"$f":"IF(W17=\"\",\"\",VLOOKUP(W17,初期設定!$D$2:$I$27,4,FALSE))","v":""},null,"記入して下さい。","034","110mH"]
[12,null,null,null,null,null,null,null,null,null,null,"",null,null,null,"",null,null,null,"",null,null,"",{"$f":"IF(W18=\"\",\"\",VLOOKUP(W18,初期設定!$D$2:$I$27,4,FALSE))","v":""},null,"その場合、点や","037","400mH(男）"]
[13,null,null,null,null,null,null,null,null,null,null,"",null,null,null,"",null,null,null,"",null,null,"",{"$f":"IF(W19=\"\",\"\",VLOOKUP(W19,初期設定!$D$2:$I$27,4,FALSE))","v":""},null,"単位記号を抜いて","042","100mH(中学女子)"]
[14,null,null,null,null,null,null,null,null,null,null,"",null,null,null,"",null,null,null,"",null,null,"",{"$f":"IF(W20=\"\",\"\",VLOOKUP(W20,初期設定!$D$2:$I$27,4,FALSE))","v":""},null,"記入して下さい。","044","100mH(女)"]
{"$rows_left_out":77}
{"sheet":"印刷","index":1,"n_rows":39,"n_cols":22,"rows_kept":39,"cut":false,"hidden":false,"merged":[[3,10,3,13],[3,14,3,17],[3,18,3,21],[2,13,2,15],[2,9,2,11],[0,9,0,15],[2,2,2,6],[1,2,1,6],[0,2,0,6],[2,18,2,20],[1,18,1,20]]}
[null,"所属ｺｰﾄﾞ",{"$f":"申込一覧表!B2","v":""},null,null,null,null,null,"大会名",{"$f":"申込一覧表!Q2","v":"２６大学"},null,null,null,null,null,null,"大会申込一覧表（Ａ）",null,null,null,null,"NO.1"]
[null,"所属名",{"$f":"申込一覧表!D2","v":0},null,null,null,null,null,null,null,null,null,null,null,null,null,"代表者名",null,{"$f":"申込一覧表!M2","v":0},null,null,"印"]
[null,"所在地",{"$f":"申込一覧表!F2","v":0},null,null,null,null,null,"電話",{"$f":"申込一覧表!I2","v":0},null,null,"携帯電話",{"$f":"申込一覧表!K2","v":0},null,null,"申込責任者",null,{"$f":"申込一覧表!O2","v":0}]
[null,null,null,null,null,null,null,"４R","16R","32R","１種目",null,null,null,"２種目",null,null,null,"３種目"]
[null,"氏　　名","学","ﾌﾘｶﾞﾅ","性","生年月日","Zken","記録","記録","記録","ｺｰﾄﾞ","種目1","記録","大会","ｺｰﾄﾞ","種目2","記録","大会","ｺｰﾄﾞ","種目3","記録","大会"]
[61,null,null,null,null,null,null,null,null,null,null,"",null,null,null,"",null,null,null,""]
[62,null,null,null,null,null,null,null,null,null,null,"",null,null,null,"",null,null,null,""]
[63,null,null,null,null,null,null,null,null,null,null,"",null,null,null,"",null,null,null,""]
[64,null,null,null,null,null,null,null,null,null,null,"",null,null,null,"",null,null,null,""]
[65,null,null,null,null,null,null,null,null,null,null,"",null,null,null,"",null,null,null,""]
[66,null,null,null,null,null,null,null,null,null,null,"",null,null,null,"",null,null,null,""]
[67,null,null,null,null,null,null,null,null,null,null,"",null,null,null,"",null,null,null,""]
[68,null,null,null,null,null,null,null,null,null,null,"",null,null,null,"",null,null,null,""]
[69,null,null,null,null,null,null,null,null,null,null,"",null,null,null,"",null,null,null,""]
[70,null,null,null,null,null,null,null,null,null,null,"",null,null,null,"",null,null,null,""]
[71,null,null,null,null,null,null,null,null,null,null,"",null,null,null,"",null,null,null,""]
[72,null,null,null,null,null,null,null,null,null,null,"",null,null,null,"",null,null,null,""]
[73,null,null,null,null,null,null,null,null,null,null,"",null,null,null,"",null,null,null,""]
[74,null,null,null,null,null,null,null,null,null,null,"",null,null,null,"",null,null,null,""]
[75,null,null,null,null,null,null,null,null,null,null,"",null,null,null,"",null,null,null,""]
{"$rows_left_out":20}
{"sheet":"初期設定","index":2,"n_rows":46,"n_cols":10,"rows_kept":46,"cut":false,"hidden":false,"merged":[]}
["ｺｰﾄﾞ","種目",null,"DB","N1","N2","N3","KC"]
["002","100m",null,40001,"ﾄｳﾎｸﾀﾞｲ","東北大","東北大学","04","宮城",{"$f":"D2","v":40001}]
["003","200m",null,60002,"ﾔﾏｶﾞﾀﾀﾞｲ","山形大","山形大学",6,"山形",{"$f":"D3","v":60002}]
["005","400m",null,70003,"ﾌｸｼﾏﾀﾞｲ","福島大","福島大学",7,"福島",70003]
["006","800m",null,80004,"ｲﾊﾞﾗｷﾀﾞｲ","茨城大","茨城大学",8,"茨城",80004]
["008","1500m",null,90005,"ｳﾂﾉﾐﾔﾀﾞｲ","宇都宮大","宇都宮大",9,"栃木",90005]
["010","3000m",null,100006,"ｸﾞﾝﾏﾀﾞｲ","群馬大","群馬大",10,"群　馬",100006]
["011","5000m",null,100007,"ﾀｶｹﾀﾞｲ","高経大","高崎経済大",10,"群　馬",100007]
["012","10000m",null,110008,"ｻｲﾀﾏﾀﾞｲ","埼玉大","埼玉大学",11,"埼玉",110008]
["032","110mH(中学)",null,120009,"ﾁﾊﾞﾀﾞｲ","千葉大","千葉大学",12,"千葉",120009]
["033","110mH(ﾕｰｽ)",null,130010,"ｼｭﾄﾀﾞｲ","首都大","首都大学東京",13,"東京",130010]
["034","110mH",null,130011,"ﾄｳｷｮｳﾉｳｺｳﾀﾞｲ","東京農工大","東京農工大学",13,"東京",130011]
["037","400mH(男）",null,130012,"ﾄｳｷｮｳｶﾞｸｹﾞｲﾀﾞｲ","東京学芸大","東京学芸大学",13,"東京",130012]
["042","100mH(中学女子)",null,130013,"ﾄｳｷｮｳｶﾞｲｺﾞﾀﾞｲ","東京外語大","東京外国語大学",13,"東京",130013]
["044","100mH(女)",null,130014,"ﾋﾄﾂﾊﾞｼﾀﾞｲ","一橋大","一橋大学",13,"東京",130014]
["046","400mH(女）",null,130015,"ﾄｳｺｳﾀﾞｲ","東工大","東京工業大学",13,"東京",130015]
["047","100mH(女ﾕｰｽ)",null,130016,"ﾃﾞﾝｷﾂｳｼﾝﾀﾞｲ","電気通信大","電気通信大学",13,"東京",130016]
["053","3000mSC",null,140017,"ﾖｺﾊﾏｺｸﾘﾂﾀﾞｲ","横浜国立大","横浜国立大学",14,"神奈川",140017]
["060","3000競歩",null,140018,"ﾖｺﾊﾏｲﾁﾘﾂﾀﾞｲ","横浜市立大","横浜市立大学",14,"神奈川",140018]
["061","5000競歩",null,150019,"ﾆｲｶﾞﾀﾀﾞｲ","新潟大","新潟大学",15,"新潟",150019]
{"$rows_left_out":27}
{"sheet":"DAT","index":3,"n_rows":92,"n_cols":14,"rows_kept":92,"cut":false,"hidden":false,"merged":[]}
["DB","N1","N2","SX","KC","MC","ZK","S1","S2","S3",null,"4R","16R","32R"]
[null,{"$f":"IF(申込一覧表!B7=\"\",\"\",IF(申込一覧表!C7=\"\",申込一覧表!B7,申込一覧表!B7&\"(\"&申込一覧表!C7&\")\"))","v":""},{"$f":"IF(申込一覧表!D7=\"\",\"\",申込一覧表!D7)","v":""},{"$f":"IF(申込一覧表!E7=\"\",\"\",申込一覧表!E7)","v":""},10,{"$f":"IF(申込一覧表!W7=\"\",\"\",申込一覧表!W7)","v":""},{"$f":"IF(申込一覧表!G7=\"\",\"\",申込一覧表!G7)","v":""},{"$f":"IF(申込一覧表!K7=\"\",\"\",申込一覧表!K7&\" \"&申込一覧表!M7)","v":""},{"$f":"IF(申込一覧表!O7=\"\",\"\",申込一覧表!O7&\" \"&申込一覧表!Q7)","v":""},{"$f":"IF(申込一覧表!S7=\"\",\"\",申込一覧表!S7&\" \"&申込一覧表!U7)","v":""},null,{"$f":"IF(申込一覧表!H7=\"\",\"\",\"0\"&申込一覧表!H7)","v":""},{"$f":"IF(申込一覧表!I7=\"\",\"\",申込一覧表!I7)","v":""},{"$f":"IF(申込一覧表!J7=\"\",\"\",申込一覧表!J7)","v":""}]
[null,{"$f":"IF(申込一覧表!B8=\"\",\"\",IF(申込一覧表!C8=\"\",申込一覧表!B8,申込一覧表!B8&\"(\"&申込一覧表!C8&\")\"))","v":""},{"$f":"IF(申込一覧表!D8=\"\",\"\",申込一覧表!D8)","v":""},{"$f":"IF(申込一覧表!E8=\"\",\"\",申込一覧表!E8)","v":""},10,{"$f":"IF(申込一覧表!W8=\"\",\"\",申込一覧表!W8)","v":""},{"$f":"IF(申込一覧表!G8=\"\",\"\",申込一覧表!G8)","v":""},{"$f":"IF(申込一覧表!K8=\"\",\"\",申込一覧表!K8&\" \"&申込一覧表!M8)","v":""},{"$f":"IF(申込一覧表!O8=\"\",\"\",申込一覧表!O8&\" \"&申込一覧表!Q8)","v":""},{"$f":"IF(申込一覧表!S8=\"\",\"\",申込一覧表!S8&\" \"&申込一覧表!U8)","v":""},null,{"$f":"IF(申込一覧表!H8=\"\",\"\",\"0\"&申込一覧表!H8)","v":""},{"$f":"IF(申込一覧表!I8=\"\",\"\",申込一覧表!I8)","v":""},{"$f":"IF(申込一覧表!J8=\"\",\"\",申込一覧表!J8)","v":""}]
[null,{"$f":"IF(申込一覧表!B9=\"\",\"\",IF(申込一覧表!C9=\"\",申込一覧表!B9,申込一覧表!B9&\"(\"&申込一覧表!C9&\")\"))","v":""},{"$f":"IF(申込一覧表!D9=\"\",\"\",申込一覧表!D9)","v":""},{"$f":"IF(申込一覧表!E9=\"\",\"\",申込一覧表!E9)","v":""},10,{"$f":"IF(申込一覧表!W9=\"\",\"\",申込一覧表!W9)","v":""},{"$f":"IF(申込一覧表!G9=\"\",\"\",申込一覧表!G9)","v":""},{"$f":"IF(申込一覧表!K9=\"\",\"\",申込一覧表!K9&\" \"&申込一覧表!M9)","v":""},{"$f":"IF(申込一覧表!O9=\"\",\"\",申込一覧表!O9&\" \"&申込一覧表!Q9)","v":""},{"$f":"IF(申込一覧表!S9=\"\",\"\",申込一覧表!S9&\" \"&申込一覧表!U9)","v":""},null,{"$f":"IF(申込一覧表!H9=\"\",\"\",\"0\"&申込一覧表!H9)","v":""},{"$f":"IF(申込一覧表!I9=\"\",\"\",申込一覧表!I9)","v":""},{"$f":"IF(申込一覧表!J9=\"\",\"\",申込一覧表!J9)","v":""}]
[null,{"$f":"IF(申込一覧表!B10=\"\",\"\",IF(申込一覧表!C10=\"\",申込一覧表!B10,申込一覧表!B10&\"(\"&申込一覧表!C10&\")\"))","v":""},{"$f":"IF(申込一覧表!D10=\"\",\"\",申込一覧表!D10)","v":""},{"$f":"IF(申込一覧表!E10=\"\",\"\",申込一覧表!E10)","v":""},10,{"$f":"IF(申込一覧表!W10=\"\",\"\",申込一覧表!W10)","v":""},{"$f":"IF(申込一覧表!G10=\"\",\"\",申込一覧表!G10)","v":""},{"$f":"IF(申込一覧表!K10=\"\",\"\",申込一覧表!K10&\" \"&申込一覧表!M10)","v":""},{"$f":"IF(申込一覧表!O10=\"\",\"\",申込一覧表!O10&\" \"&申込一覧表!Q10)","v":""},{"$f":"IF(申込一覧表!S10=\"\",\"\",申込一覧表!S10&\" \"&申込一覧表!U10)","v":""},null,{"$f":"IF(申込一覧表!H10=\"\",\"\",\"0\"&申込一覧表!H10)","v":""},{"$f":"IF(申込一覧表!I10=\"\",\"\",申込一覧表!I10)","v":""},{"$f":"IF(申込一覧表!J10=\"\",\"\",申込一覧表!J10)","v":""}]
[null,{"$f":"IF(申込一覧表!B11=\"\",\"\",IF(申込一覧表!C11=\"\",申込一覧表!B11,申込一覧表!B11&\"(\"&申込一覧表!C11&\")\"))","v":""},{"$f":"IF(申込一覧表!D11=\"\",\"\",申込一覧表!D11)","v":""},{"$f":"IF(申込一覧表!E11=\"\",\"\",申込一覧表!E11)","v":""},10,{"$f":"IF(申込一覧表!W11=\"\",\"\",申込一覧表!W11)","v":""},{"$f":"IF(申込一覧表!G11=\"\",\"\",申込一覧表!G11)","v":""},{"$f":"IF(申込一覧表!K11=\"\",\"\",申込一覧表!K11&\" \"&申込一覧表!M11)","v":""},{"$f":"IF(申込一覧表!O11=\"\",\"\",申込一覧表!O11&\" \"&申込一覧表!Q11)","v":""},{"$f":"IF(申込一覧表!S11=\"\",\"\",申込一覧表!S11&\" \"&申込一覧表!U11)","v":""},null,{"$f":"IF(申込一覧表!H11=\"\",\"\",\"0\"&申込一覧表!H11)","v":""},{"$f":"IF(申込一覧表!I11=\"\",\"\",申込一覧表!I11)","v":""},{"$f":"IF(申込一覧表!J11=\"\",\"\",申込一覧表!J11)","v":""}]
[null,{"$f":"IF(申込一覧表!B12=\"\",\"\",IF(申込一覧表!C12=\"\",申込一覧表!B12,申込一覧表!B12&\"(\"&申込一覧表!C12&\")\"))","v":""},{"$f":"IF(申込一覧表!D12=\"\",\"\",申込一覧表!D12)","v":""},{"$f":"IF(申込一覧表!E12=\"\",\"\",申込一覧表!E12)","v":""},10,{"$f":"IF(申込一覧表!W12=\"\",\"\",申込一覧表!W12)","v":""},{"$f":"IF(申込一覧表!G12=\"\",\"\",申込一覧表!G12)","v":""},{"$f":"IF(申込一覧表!K12=\"\",\"\",申込一覧表!K12&\" \"&申込一覧表!M12)","v":""},{"$f":"IF(申込一覧表!O12=\"\",\"\",申込一覧表!O12&\" \"&申込一覧表!Q12)","v":""},{"$f":"IF(申込一覧表!S12=\"\",\"\",申込一覧表!S12&\" \"&申込一覧表!U12)","v":""},null,{"$f":"IF(申込一覧表!H12=\"\",\"\",\"0\"&申込一覧表!H12)","v":""},{"$f":"IF(申込一覧表!I12=\"\",\"\",申込一覧表!I12)","v":""},{"$f":"IF(申込一覧表!J12=\"\",\"\",申込一覧表!J12)","v":""}]
[null,{"$f":"IF(申込一覧表!B13=\"\",\"\",IF(申込一覧表!C13=\"\",申込一覧表!B13,申込一覧表!B13&\"(\"&申込一覧表!C13&\")\"))","v":""},{"$f":"IF(申込一覧表!D13=\"\",\"\",申込一覧表!D13)","v":""},{"$f":"IF(申込一覧表!E13=\"\",\"\",申込一覧表!E13)","v":""},10,{"$f":"IF(申込一覧表!W13=\"\",\"\",申込一覧表!W13)","v":""},{"$f":"IF(申込一覧表!G13=\"\",\"\",申込一覧表!G13)","v":""},{"$f":"IF(申込一覧表!K13=\"\",\"\",申込一覧表!K13&\" \"&申込一覧表!M13)","v":""},{"$f":"IF(申込一覧表!O13=\"\",\"\",申込一覧表!O13&\" \"&申込一覧表!Q13)","v":""},{"$f":"IF(申込一覧表!S13=\"\",\"\",申込一覧表!S13&\" \"&申込一覧表!U13)","v":""},null,{"$f":"IF(申込一覧表!H13=\"\",\"\",\"0\"&申込一覧表!H13)","v":""},{"$f":"IF(申込一覧表!I13=\"\",\"\",申込一覧表!I13)","v":""},{"$f":"IF(申込一覧表!J13=\"\",\"\",申込一覧表!J13)","v":""}]
[null,{"$f":"IF(申込一覧表!B14=\"\",\"\",IF(申込一覧表!C14=\"\",申込一覧表!B14,申込一覧表!B14&\"(\"&申込一覧表!C14&\")\"))","v":""},{"$f":"IF(申込一覧表!D14=\"\",\"\",申込一覧表!D14)","v":""},{"$f":"IF(申込一覧表!E14=\"\",\"\",申込一覧表!E14)","v":""},10,{"$f":"IF(申込一覧表!W14=\"\",\"\",申込一覧表!W14)","v":""},{"$f":"IF(申込一覧表!G14=\"\",\"\",申込一覧表!G14)","v":""},{"$f":"IF(申込一覧表!K14=\"\",\"\",申込一覧表!K14&\" \"&申込一覧表!M14)","v":""},{"$f":"IF(申込一覧表!O14=\"\",\"\",申込一覧表!O14&\" \"&申込一覧表!Q14)","v":""},{"$f":"IF(申込一覧表!S14=\"\",\"\",申込一覧表!S14&\" \"&申込一覧表!U14)","v":""},null,{"$f":"IF(申込一覧表!H14=\"\",\"\",\"0\"&申込一覧表!H14)","v":""},{"$f":"IF(申込一覧表!I14=\"\",\"\",申込一覧表!I14)","v":""},{"$f":"IF(申込一覧表!J14=\"\",\"\",申込一覧表!J14)","v":""}]
[null,{"$f":"IF(申込一覧表!B15=\"\",\"\",IF(申込一覧表!C15=\"\",申込一覧表!B15,申込一覧表!B15&\"(\"&申込一覧表!C15&\")\"))","v":""},{"$f":"IF(申込一覧表!D15=\"\",\"\",申込一覧表!D15)","v":""},{"$f":"IF(申込一覧表!E15=\"\",\"\",申込一覧表!E15)","v":""},10,{"$f":"IF(申込一覧表!W15=\"\",\"\",申込一覧表!W15)","v":""},{"$f":"IF(申込一覧表!G15=\"\",\"\",申込一覧表!G15)","v":""},{"$f":"IF(申込一覧表!K15=\"\",\"\",申込一覧表!K15&\" \"&申込一覧表!M15)","v":""},{"$f":"IF(申込一覧表!O15=\"\",\"\",申込一覧表!O15&\" \"&申込一覧表!Q15)","v":""},{"$f":"IF(申込一覧表!S15=\"\",\"\",申込一覧表!S15&\" \"&申込一覧表!U15)","v":""},null,{"$f":"IF(申込一覧表!H15=\"\",\"\",\"0\"&申込一覧表!H15)","v":""},{"$f":"IF(申込一覧表!I15=\"\",\"\",申込一覧表!I15)","v":""},{"$f":"IF(申込一覧表!J15=\"\",\"\",申込一覧表!J15)","v":""}]
[null,{"$f":"IF(申込一覧表!B16=\"\",\"\",IF(申込一覧表!C16=\"\",申込一覧表!B16,申込一覧表!B16&\"(\"&申込一覧表!C16&\")\"))","v":""},{"$f":"IF(申込一覧表!D16=\"\",\"\",申込一覧表!D16)","v":""},{"$f":"IF(申込一覧表!E16=\"\",\"\",申込一覧表!E16)","v":""},10,{"$f":"IF(申込一覧表!W16=\"\",\"\",申込一覧表!W16)","v":""},{"$f":"IF(申込一覧表!G16=\"\",\"\",申込一覧表!G16)","v":""},{"$f":"IF(申込一覧表!K16=\"\",\"\",申込一覧表!K16&\" \"&申込一覧表!M16)","v":""},{"$f":"IF(申込一覧表!O16=\"\",\"\",申込一覧表!O16&\" \"&申込一覧表!Q16)","v":""},{"$f":"IF(申込一覧表!S16=\"\",\"\",申込一覧表!S16&\" \"&申込一覧表!U16)","v":""},null,{"$f":"IF(申込一覧表!H16=\"\",\"\",\"0\"&申込一覧表!H16)","v":""},{"$f":"IF(申込一覧表!I16=\"\",\"\",申込一覧表!I16)","v":""},{"$f":"IF(申込一覧表!J16=\"\",\"\",申込一覧表!J16)","v":""}]
[null,{"$f":"IF(申込一覧表!B17=\"\",\"\",IF(申込一覧表!C17=\"\",申込一覧表!B17,申込一覧表!B17&\"(\"&申込一覧表!C17&\")\"))","v":""},{"$f":"IF(申込一覧表!D17=\"\",\"\",申込一覧表!D17)","v":""},{"$f":"IF(申込一覧表!E17=\"\",\"\",申込一覧表!E17)","v":""},10,{"$f":"IF(申込一覧表!W17=\"\",\"\",申込一覧表!W17)","v":""},{"$f":"IF(申込一覧表!G17=\"\",\"\",申込一覧表!G17)","v":""},{"$f":"IF(申込一覧表!K17=\"\",\"\",申込一覧表!K17&\" \"&申込一覧表!M17)","v":""},{"$f":"IF(申込一覧表!O17=\"\",\"\",申込一覧表!O17&\" \"&申込一覧表!Q17)","v":""},{"$f":"IF(申込一覧表!S17=\"\",\"\",申込一覧表!S17&\" \"&申込一覧表!U17)","v":""},null,{"$f":"IF(申込一覧表!H17=\"\",\"\",\"0\"&申込一覧表!H17)","v":""},{"$f":"IF(申込一覧表!I17=\"\",\"\",申込一覧表!I17)","v":""},{"$f":"IF(申込一覧表!J17=\"\",\"\",申込一覧表!J17)","v":""}]
[null,{"$f":"IF(申込一覧表!B18=\"\",\"\",IF(申込一覧表!C18=\"\",申込一覧表!B18,申込一覧表!B18&\"(\"&申込一覧表!C18&\")\"))","v":""},{"$f":"IF(申込一覧表!D18=\"\",\"\",申込一覧表!D18)","v":""},{"$f":"IF(申込一覧表!E18=\"\",\"\",申込一覧表!E18)","v":""},10,{"$f":"IF(申込一覧表!W18=\"\",\"\",申込一覧表!W18)","v":""},{"$f":"IF(申込一覧表!G18=\"\",\"\",申込一覧表!G18)","v":""},{"$f":"IF(申込一覧表!K18=\"\",\"\",申込一覧表!K18&\" \"&申込一覧表!M18)","v":""},{"$f":"IF(申込一覧表!O18=\"\",\"\",申込一覧表!O18&\" \"&申込一覧表!Q18)","v":""},{"$f":"IF(申込一覧表!S18=\"\",\"\",申込一覧表!S18&\" \"&申込一覧表!U18)","v":""},null,{"$f":"IF(申込一覧表!H18=\"\",\"\",\"0\"&申込一覧表!H18)","v":""},{"$f":"IF(申込一覧表!I18=\"\",\"\",申込一覧表!I18)","v":""},{"$f":"IF(申込一覧表!J18=\"\",\"\",申込一覧表!J18)","v":""}]
[null,{"$f":"IF(申込一覧表!B19=\"\",\"\",IF(申込一覧表!C19=\"\",申込一覧表!B19,申込一覧表!B19&\"(\"&申込一覧表!C19&\")\"))","v":""},{"$f":"IF(申込一覧表!D19=\"\",\"\",申込一覧表!D19)","v":""},{"$f":"IF(申込一覧表!E19=\"\",\"\",申込一覧表!E19)","v":""},10,{"$f":"IF(申込一覧表!W19=\"\",\"\",申込一覧表!W19)","v":""},{"$f":"IF(申込一覧表!G19=\"\",\"\",申込一覧表!G19)","v":""},{"$f":"IF(申込一覧表!K19=\"\",\"\",申込一覧表!K19&\" \"&申込一覧表!M19)","v":""},{"$f":"IF(申込一覧表!O19=\"\",\"\",申込一覧表!O19&\" \"&申込一覧表!Q19)","v":""},{"$f":"IF(申込一覧表!S19=\"\",\"\",申込一覧表!S19&\" \"&申込一覧表!U19)","v":""},null,{"$f":"IF(申込一覧表!H19=\"\",\"\",\"0\"&申込一覧表!H19)","v":""},{"$f":"IF(申込一覧表!I19=\"\",\"\",申込一覧表!I19)","v":""},{"$f":"IF(申込一覧表!J19=\"\",\"\",申込一覧表!J19)","v":""}]
[null,{"$f":"IF(申込一覧表!B20=\"\",\"\",IF(申込一覧表!C20=\"\",申込一覧表!B20,申込一覧表!B20&\"(\"&申込一覧表!C20&\")\"))","v":""},{"$f":"IF(申込一覧表!D20=\"\",\"\",申込一覧表!D20)","v":""},{"$f":"IF(申込一覧表!E20=\"\",\"\",申込一覧表!E20)","v":""},10,{"$f":"IF(申込一覧表!W20=\"\",\"\",申込一覧表!W20)","v":""},{"$f":"IF(申込一覧表!G20=\"\",\"\",申込一覧表!G20)","v":""},{"$f":"IF(申込一覧表!K20=\"\",\"\",申込一覧表!K20&\" \"&申込一覧表!M20)","v":""},{"$f":"IF(申込一覧表!O20=\"\",\"\",申込一覧表!O20&\" \"&申込一覧表!Q20)","v":""},{"$f":"IF(申込一覧表!S20=\"\",\"\",申込一覧表!S20&\" \"&申込一覧表!U20)","v":""},null,{"$f":"IF(申込一覧表!H20=\"\",\"\",\"0\"&申込一覧表!H20)","v":""},{"$f":"IF(申込一覧表!I20=\"\",\"\",申込一覧表!I20)","v":""},{"$f":"IF(申込一覧表!J20=\"\",\"\",申込一覧表!J20)","v":""}]
[null,{"$f":"IF(申込一覧表!B21=\"\",\"\",IF(申込一覧表!C21=\"\",申込一覧表!B21,申込一覧表!B21&\"(\"&申込一覧表!C21&\")\"))","v":""},{"$f":"IF(申込一覧表!D21=\"\",\"\",申込一覧表!D21)","v":""},{"$f":"IF(申込一覧表!E21=\"\",\"\",申込一覧表!E21)","v":""},10,{"$f":"IF(申込一覧表!W21=\"\",\"\",申込一覧表!W21)","v":""},{"$f":"IF(申込一覧表!G21=\"\",\"\",申込一覧表!G21)","v":""},{"$f":"IF(申込一覧表!K21=\"\",\"\",申込一覧表!K21&\" \"&申込一覧表!M21)","v":""},{"$f":"IF(申込一覧表!O21=\"\",\"\",申込一覧表!O21&\" \"&申込一覧表!Q21)","v":""},{"$f":"IF(申込一覧表!S21=\"\",\"\",申込一覧表!S21&\" \"&申込一覧表!U21)","v":""},null,{"$f":"IF(申込一覧表!H21=\"\",\"\",\"0\"&申込一覧表!H21)","v":""},{"$f":"IF(申込一覧表!I21=\"\",\"\",申込一覧表!I21)","v":""},{"$f":"IF(申込一覧表!J21=\"\",\"\",申込一覧表!J21)","v":""}]
[null,{"$f":"IF(申込一覧表!B22=\"\",\"\",IF(申込一覧表!C22=\"\",申込一覧表!B22,申込一覧表!B22&\"(\"&申込一覧表!C22&\")\"))","v":""},{"$f":"IF(申込一覧表!D22=\"\",\"\",申込一覧表!D22)","v":""},{"$f":"IF(申込一覧表!E22=\"\",\"\",申込一覧表!E22)","v":""},10,{"$f":"IF(申込一覧表!W22=\"\",\"\",申込一覧表!W22)","v":""},{"$f":"IF(申込一覧表!G22=\"\",\"\",申込一覧表!G22)","v":""},{"$f":"IF(申込一覧表!K22=\"\",\"\",申込一覧表!K22&\" \"&申込一覧表!M22)","v":""},{"$f":"IF(申込一覧表!O22=\"\",\"\",申込一覧表!O22&\" \"&申込一覧表!Q22)","v":""},{"$f":"IF(申込一覧表!S22=\"\",\"\",申込一覧表!S22&\" \"&申込一覧表!U22)","v":""},null,{"$f":"IF(申込一覧表!H22=\"\",\"\",\"0\"&申込一覧表!H22)","v":""},{"$f":"IF(申込一覧表!I22=\"\",\"\",申込一覧表!I22)","v":""},{"$f":"IF(申込一覧表!J22=\"\",\"\",申込一覧表!J22)","v":""}]
[null,{"$f":"IF(申込一覧表!B23=\"\",\"\",IF(申込一覧表!C23=\"\",申込一覧表!B23,申込一覧表!B23&\"(\"&申込一覧表!C23&\")\"))","v":""},{"$f":"IF(申込一覧表!D23=\"\",\"\",申込一覧表!D23)","v":""},{"$f":"IF(申込一覧表!E23=\"\",\"\",申込一覧表!E23)","v":""},10,{"$f":"IF(申込一覧表!W23=\"\",\"\",申込一覧表!W23)","v":""},{"$f":"IF(申込一覧表!G23=\"\",\"\",申込一覧表!G23)","v":""},{"$f":"IF(申込一覧表!K23=\"\",\"\",申込一覧表!K23&\" \"&申込一覧表!M23)","v":""},{"$f":"IF(申込一覧表!O23=\"\",\"\",申込一覧表!O23&\" \"&申込一覧表!Q23)","v":""},{"$f":"IF(申込一覧表!S23=\"\",\"\",申込一覧表!S23&\" \"&申込一覧表!U23)","v":""},null,{"$f":"IF(申込一覧表!H23=\"\",\"\",\"0\"&申込一覧表!H23)","v":""},{"$f":"IF(申込一覧表!I23=\"\",\"\",申込一覧表!I23)","v":""},{"$f":"IF(申込一覧表!J23=\"\",\"\",申込一覧表!J23)","v":""}]
[null,{"$f":"IF(申込一覧表!B24=\"\",\"\",IF(申込一覧表!C24=\"\",申込一覧表!B24,申込一覧表!B24&\"(\"&申込一覧表!C24&\")\"))","v":""},{"$f":"IF(申込一覧表!D24=\"\",\"\",申込一覧表!D24)","v":""},{"$f":"IF(申込一覧表!E24=\"\",\"\",申込一覧表!E24)","v":""},10,{"$f":"IF(申込一覧表!W24=\"\",\"\",申込一覧表!W24)","v":""},{"$f":"IF(申込一覧表!G24=\"\",\"\",申込一覧表!G24)","v":""},{"$f":"IF(申込一覧表!K24=\"\",\"\",申込一覧表!K24&\" \"&申込一覧表!M24)","v":""},{"$f":"IF(申込一覧表!O24=\"\",\"\",申込一覧表!O24&\" \"&申込一覧表!Q24)","v":""},{"$f":"IF(申込一覧表!S24=\"\",\"\",申込一覧表!S24&\" \"&申込一覧表!U24)","v":""},null,{"$f":"IF(申込一覧表!H24=\"\",\"\",\"0\"&申込一覧表!H24)","v":""},{"$f":"IF(申込一覧表!I24=\"\",\"\",申込一覧表!I24)","v":""},{"$f":"IF(申込一覧表!J24=\"\",\"\",申込一覧表!J24)","v":""}]
[null,{"$f":"IF(申込一覧表!B25=\"\",\"\",IF(申込一覧表!C25=\"\",申込一覧表!B25,申込一覧表!B25&\"(\"&申込一覧表!C25&\")\"))","v":""},{"$f":"IF(申込一覧表!D25=\"\",\"\",申込一覧表!D25)","v":""},{"$f":"IF(申込一覧表!E25=\"\",\"\",申込一覧表!E25)","v":""},10,{"$f":"IF(申込一覧表!W25=\"\",\"\",申込一覧表!W25)","v":""},{"$f":"IF(申込一覧表!G25=\"\",\"\",申込一覧表!G25)","v":""},{"$f":"IF(申込一覧表!K25=\"\",\"\",申込一覧表!K25&\" \"&申込一覧表!M25)","v":""},{"$f":"IF(申込一覧表!O25=\"\",\"\",申込一覧表!O25&\" \"&申込一覧表!Q25)","v":""},{"$f":"IF(申込一覧表!S25=\"\",\"\",申込一覧表!S25&\" \"&申込一覧表!U25)","v":""},null,{"$f":"IF(申込一覧表!H25=\"\",\"\",\"0\"&申込一覧表!H25)","v":""},{"$f":"IF(申込一覧表!I25=\"\",\"\",申込一覧表!I25)","v":""},{"$f":"IF(申込一覧表!J25=\"\",\"\",申込一覧表!J25)","v":""}]
{"$rows_left_out":72}